Target
Alpha-2C adrenergic receptor
Ligand
BDBM81984
Substrate
Ki
3890.45±n/a nM
Comments
PDSP_915
Citation
 Jasper, JRLesnick, JDChang, LKYamanishi, SSChang, TKHsu, SADaunt, DABonhaus, DWEglen, RM Ligand efficacy and potency at recombinant alpha2 adrenergic receptors: agonist-mediated [35S]GTPgammaS binding. Biochem Pharmacol 55:1035-43 (1998)  
Target
Name:
Alpha-2C adrenergic receptor
Synonyms:
ADA2C_HUMAN ADRA2L2 Adrenergic alpha2C Adrenergic receptor alpha Alpha-2 adrenergic receptor subtype C4 Alpha-2C adrenoreceptor | adrenergic, alpha-2C-, receptor [Homo sapiens]
Type:
Enzyme
Mol. Mass.:
49552.32
Organism:
Homo sapiens (Human)
Description:
P18825
Residue:
462
  
Inhibitor
Name:
BDBM81984
Synonyms:
CAS_29110-47-2 NSC_3519
Type:
Small organic molecule
Emp. Form.:
C9H9Cl2N3O
Mol. Mass.:
246.093
SMILES:
NC(=N)NC(=O)Cc1c(Cl)cccc1Cl
: