Target
Melatonin receptor type 1A
Ligand
BDBM50035179
Substrate
Ki
0.09±n/a nM
Comments
PDSP_1657
Citation
 Beresford, IJBrowning, CStarkey, SJBrown, JFoord, SMCoughlan, JNorth, PCDubocovich, MLHagan, RM GR196429: a nonindolic agonist at high-affinity melatonin receptors. J Pharmacol Exp Ther 285:1239-45 (1998) Target
Name:
Melatonin receptor type 1A
Synonyms:
MTNR1A Melatonin | Melatonin receptor type 1A
Type:
Enzyme Catalytic Domain
Mol. Mass.:
17908.30
Organism:
GUINEA PIG
Description:
Melatonin 0 GUINEA PIG::O02781
Residue:
154
  
Inhibitor
Name:
BDBM50035179
Synonyms:
Agomelatine N-[2-(7-Methoxy-naphthalen-1-yl)-ethyl]-acetamide S 20098 US11091445, Compound code IA2-76
Type:
Small organic molecule
Emp. Form.:
C15H17NO2
Mol. Mass.:
243.301
SMILES:
COc1ccc2cccc(CCNC(C)=O)c2c1
: