Target
Prostaglandin G/H synthase 1
Ligand
BDBM50002861
Substrate
Ki
>10000±n/a nM
Comments
PDSP_4485
Citation
 Cryer, BFeldman, M Cyclooxygenase-1 and cyclooxygenase-2 selectivity of widely used nonsteroidal anti-inflammatory drugs. Am J Med 104:413-21 (1998)  
Target
Name:
Prostaglandin G/H synthase 1
Synonyms:
COX-1 Cyclooxygenase Cyclooxygenase-1 (COX-1) PTGS1 | Prostaglandin G/H synthase (cyclooxygenase)
Type:
Enzyme
Mol. Mass.:
68692.62
Organism:
Homo sapiens (Human)
Description:
P23219
Residue:
599
  
Inhibitor
Name:
BDBM50002861
Synonyms:
3-(4,5-Diphenyl-oxazol-2-yl)-propionic acid Daypro WY-21743 | oxaprosin
Type:
Small organic molecule
Emp. Form.:
C18H15NO3
Mol. Mass.:
293.3166
SMILES:
OC(=O)CCc1nc(c(o1)-c1ccccc1)-c1ccccc1
: