Target
Adenomatous polyposis coli protein
Ligand
BDBM270480
Substrate
Meas. Tech.
Wnt APC Inhibition Assay
IC50
21.0±n/a nM
Citation
 Hood, JKC, SKWallace, DM 1H-pyrazolo[3,4-b]pyridines and therapeutic uses thereof US Patent  US10071086 Publication Date 9/11/2018 
Target
Name:
Adenomatous polyposis coli protein
Synonyms:
APC DP2.5 Protein APC
Type:
Enzyme Catalytic Domain
Mol. Mass.:
311681.21
Organism:
Homo sapiens (Human)
Description:
Residue:
2843
  
Inhibitor
Name:
BDBM270480
Synonyms:
US10071086, Compound 24
Type:
Small organic molecule
Emp. Form.:
C30H28FN9O
Mol. Mass.:
549.6014
SMILES:
CN(C)Cc1cncc(c1)-c1cnc2[nH]nc(-c3nc4c(cncc4[nH]3)-c3cc(F)cc(c3)N3CCOCC3)c2c1
: