Target
Adenomatous polyposis coli protein
Ligand
BDBM275737
Substrate
Meas. Tech.
Wnt APC Inhibition Assay
IC50
36.0±n/a nM
Citation
 Hood, JKC, SKWallace, DM 1H-pyrazolo[3,4-b]pyridines and therapeutic uses thereof US Patent  US10071086 Publication Date 9/11/2018 
Target
Name:
Adenomatous polyposis coli protein
Synonyms:
APC DP2.5 Protein APC
Type:
Enzyme Catalytic Domain
Mol. Mass.:
311681.21
Organism:
Homo sapiens (Human)
Description:
Residue:
2843
  
Inhibitor
Name:
BDBM275737
Synonyms:
US10071086, Compound 621
Type:
Small organic molecule
Emp. Form.:
C26H22N8
Mol. Mass.:
446.5065
SMILES:
CN(C)Cc1cncc(c1)-c1cnc2[nH]nc(-c3nc4c(cccc4[nH]3)-c3cccnc3)c2c1
: