Target
Alpha-1B adrenergic receptor
Ligand
BDBM50033112
Substrate
Ki
125.89±n/a nM
Comments
PDSP_181
Citation
 Wikberg-Matsson, AWikberg, JEUhlén, S Characterization of alpha1-adrenoceptor subtypes in the pig. Eur J Pharmacol 347:301-9 (1998)  
Target
Name:
Alpha-1B adrenergic receptor
Synonyms:
ADRA1B | adrenergic Alpha1B
Type:
Enzyme Catalytic Domain
Mol. Mass.:
34826.67
Organism:
PIG
Description:
Q70HQ0
Residue:
316
  
Inhibitor
Name:
BDBM50033112
Synonyms:
6-{3-[4-(2-Methoxy-phenyl)-piperazin-1-yl]-propylamino}-1,3,5-trimethyl-1H-pyrimidine-2,4-dione Urapidil-5-methyl
Type:
Small organic molecule
Emp. Form.:
C21H31N5O3
Mol. Mass.:
401.5025
SMILES:
COc1ccccc1N1CCN(CCCNc2c(C)c(=O)n(C)c(=O)n2C)CC1
: