Target
D(2) dopamine receptor
Ligand
BDBM50009057
Substrate
Ki
>10000±n/a nM
Comments
PDSP_1214
Citation
 Toll, LBerzetei-Gurske, IPPolgar, WEBrandt, SRAdapa, IDRodriguez, LSchwartz, RWHaggart, DO'Brien, AWhite, AKennedy, JMCraymer, KFarrington, LAuh, JS Standard binding and functional assays related to medications development division testing for potential cocaine and opiate narcotic treatment medications. NIDA Res Monogr 178:440-66 (1998) Target
Name:
D(2) dopamine receptor
Synonyms:
D(2) dopamine receptor DOPAMINE D2 Long DRD2 Dopamine D2 receptor Dopamine D2 receptor (D2R) Dopamine2-like | d2
Type:
Cell-surface receptors
Mol. Mass.:
50647.10
Organism:
Homo sapiens (Human)
Description:
P14416
Residue:
443
  
Inhibitor
Name:
BDBM50009057
Synonyms:
(R)Methyl-(1-methyl-2-phenyl-ethyl)-amine METHAMPHETAMINE (+) Methyl-(1-methyl-2-phenyl-ethyl)-amine | Methyl-(1-methyl-2-phenyl-ethyl)-amine(methamphetamine)
Type:
Small organic molecule
Emp. Form.:
C10H15N
Mol. Mass.:
149.2328
SMILES:
CNC(C)Cc1ccccc1
: