Target
Muscarinic acetylcholine receptor M4
Ligand
BDBM82371
Substrate
Ki
95.49±n/a nM
Comments
PDSP_1918
Citation
 Chelala, JLKilani, AMiller, MJMartin, RJErnsberger, P Muscarinic receptor binding sites of the M4 subtype in porcine lung parenchyma. Pharmacol Toxicol 83:200-7 (1998)  
Target
Name:
Muscarinic acetylcholine receptor M4
Synonyms:
ACM4_RAT Chrm-4 | Chrm4
Type:
Enzyme Catalytic Domain
Mol. Mass.:
52841.70
Organism:
RAT
Description:
Cholinergic, muscarinic M4 CHRM4 RAT::P08485
Residue:
477
  
Inhibitor
Name:
BDBM82371
Synonyms:
CAS_1508-75-4 TROPICAMIDE
Type:
Small organic molecule
Emp. Form.:
C17H20N2O2
Mol. Mass.:
284.3529
SMILES:
CCN(Cc1ccncc1)C(=O)C(CO)c1ccccc1
: