Target
Prostaglandin G/H synthase 2
Ligand
BDBM50097346
Substrate
Ki
4300±n/a nM
Comments
PDSP_4454
Citation
 Warner, TDGiuliano, FVojnovic, IBukasa, AMitchell, JAVane, JR Nonsteroid drug selectivities for cyclo-oxygenase-1 rather than cyclo-oxygenase-2 are associated with human gastrointestinal toxicity: a full in vitro analysis. Proc Natl Acad Sci U S A 96:7563-8 (1999)  
Target
Name:
Prostaglandin G/H synthase 2
Synonyms:
COX2 Cyclooxygenase 2 (COX-2) Cyclooxygenase-2 (COX-2 AA) Cyclooxygenase-2 (COX-2) PGH2_HUMAN PHS II Prostaglandin E synthase/G/H synthase 2 Prostaglandin-endoperoxide synthase 2
Type:
Enzyme
Mol. Mass.:
69003.89
Organism:
Homo sapiens (Human)
Description:
Recombinant Cox-2 provided by Cayman (Cayman Chemical Co.,Ann Arbor, MI).
Residue:
604
  
Inhibitor
Name:
BDBM50097346
Synonyms:
(+/-)-2-(3-chloro-9H-carbazol-7-yl)propanoic acid 2-(6-Chloro-9H-carbazol-2-yl)-propionic acid(carprofen) CARPROFEN Rimadyl | Ro-20-5720/000
Type:
Small organic molecule
Emp. Form.:
C15H12ClNO2
Mol. Mass.:
273.714
SMILES:
CC(C(O)=O)c1ccc2c(c1)[nH]c1ccc(Cl)cc21
: