Target
5-hydroxytryptamine receptor 2B
Ligand
BDBM50249134
Substrate
Ki
0.32±n/a nM
Comments
PDSP_3873
Citation
 Bonhaus, DWFlippin, LAGreenhouse, RJJaime, SRocha, CDawson, MVan Natta, KChang, LKPulido-Rios, TWebber, ALeung, EEglen, RMMartin, GR RS-127445: a selective, high affinity, orally bioavailable 5-HT2B receptor antagonist. Br J Pharmacol 127:1075-82 (1999)  
Target
Name:
5-hydroxytryptamine receptor 2B
Synonyms:
5-HT-2B 5-hydroxytryptamine (serotonin) receptor 2B [Homo sapiens] 5-hydroxytryptamine receptor 2C (5HT2C) HTR2B Serotonin 2b (5-HT2b) receptor | Serotonin Receptor 2B
Type:
G Protein-Coupled Receptor (GPCR)
Mol. Mass.:
54312.47
Organism:
Homo sapiens (Human)
Description:
Receptor binding assays were performed using human clone stably expressed in CHO cells.
Residue:
481
  
Inhibitor
Name:
BDBM50249134
Synonyms:
4-(4-fluoronaphthalen-1-yl)-6-isopropylpyrimidin-2-amine RS-127445
Type:
Small organic molecule
Emp. Form.:
C17H16FN3
Mol. Mass.:
281.3274
SMILES:
CC(C)c1cc(nc(N)n1)-c1ccc(F)c2ccccc12
: