Target
Adenosine receptor A1
Ligand
BDBM82558
Substrate
Ki
70±n/a nM
Comments
PDSP_946
Citation
 Linden, JThai, TFigler, HJin, XRobeva, AS Characterization of human A(2B) adenosine receptors: radioligand binding, western blotting, and coupling to G(q) in human embryonic kidney 293 cells and HMC-1 mast cells. Mol Pharmacol 56:705-13 (1999) Target
Name:
Adenosine receptor A1
Synonyms:
A1 adenosine receptor (hA1) AA1R_HUMAN ADORA1 Adenosine A1-receptor Adenosine receptor A1 (hA1) | Adenosine transporter (AdT)
Type:
G Protein-Coupled Receptor (GPCR)
Mol. Mass.:
36520.92
Organism:
Homo sapiens (Human)
Description:
P30542
Residue:
326
  
Inhibitor
Name:
BDBM82558
Synonyms:
CAS_163889 I-ABOPX | NSC_163889
Type:
Small organic molecule
Emp. Form.:
C23H22IN5O5
Mol. Mass.:
575.3558
SMILES:
CCCn1c(=O)n(Cc2ccc(N)c(I)c2)c2nc([nH]c2c1=O)-c1ccc(OCC(O)=O)cc1
: