Target
5-hydroxytryptamine receptor 2A
Ligand
BDBM22867
Substrate
Ki
1.4±n/a nM
Comments
PDSP_1079
Citation
 Egan, CGrinde, EDupre, ARoth, BLHake, MTeitler, MHerrick-Davis, K Agonist high and low affinity state ratios predict drug intrinsic activity and a revised ternary complex mechanism at serotonin 5-HT(2A) and 5-HT(2C) receptors. Synapse 35:144-50 (2000)  
Target
Name:
5-hydroxytryptamine receptor 2A
Synonyms:
5-HT-2 5-HT2A 5-hydroxytryptamine receptor 2A (5HT-2A) 5HT2A_HUMAN HTR2A | Serotonin receptor 2A
Type:
undefined
Mol. Mass.:
52607.65
Organism:
Homo sapiens (Human)
Description:
P28223
Residue:
471
  
Inhibitor
Name:
BDBM22867
Synonyms:
1,1-diethyl-3-[(8beta)-6-methyl-9,10-didehydroergolin-8-yl]urea 8R-lisuride | LISURIDE
Type:
Small organic molecule
Emp. Form.:
C20H26N4O
Mol. Mass.:
338.4466
SMILES:
[H][C@@]12Cc3c[nH]c4cccc(C1=C[C@H](CN2C)NC(=O)N(CC)CC)c34
: