Target
Prostaglandin E2 receptor EP2 subtype
Ligand
BDBM85178
Substrate
Ki
>10000±n/a nM
Comments
PDSP_4308
Citation
 Abramovitz, MAdam, MBoie, YCarrière, MDenis, DGodbout, CLamontagne, SRochette, CSawyer, NTremblay, NMBelley, MGallant, MDufresne, CGareau, YRuel, RJuteau, HLabelle, MOuimet, NMetters, KM The utilization of recombinant prostanoid receptors to determine the affinities and selectivities of prostaglandins and related analogs. Biochim Biophys Acta 1483:285-93 (2000)  
Target
Name:
Prostaglandin E2 receptor EP2 subtype
Synonyms:
PE2R2_HUMAN PTGER2 Prostaglandin E2 receptor Prostanoid EP2 Receptor
Type:
Enzyme
Mol. Mass.:
39775.71
Organism:
Homo sapiens (Human)
Description:
P43116
Residue:
358
  
Inhibitor
Name:
BDBM85178
Synonyms:
CAS_59122-46-2 MISOPROSTOL (Methyl Ester) | NSC_5282381
Type:
Small organic molecule
Emp. Form.:
C22H38O5
Mol. Mass.:
382.5341
SMILES:
CCCCC(C)(O)CC=CC1C(O)CC(=O)C1CCCCCCC(=O)OC
: