Target
Prostacyclin receptor
Ligand
BDBM85178
Substrate
Ki
>10000±n/a nM
Comments
PDSP_4308
Citation
 Abramovitz, MAdam, MBoie, YCarrière, MDenis, DGodbout, CLamontagne, SRochette, CSawyer, NTremblay, NMBelley, MGallant, MDufresne, CGareau, YRuel, RJuteau, HLabelle, MOuimet, NMetters, KM The utilization of recombinant prostanoid receptors to determine the affinities and selectivities of prostaglandins and related analogs. Biochim Biophys Acta 1483:285-93 (2000)  
Target
Name:
Prostacyclin receptor
Synonyms:
PGI receptor PRIPR Prostacyclin (IP) Receptor Prostaglandin I Prostaglandin I2 receptor | Prostanoid IP receptor
Type:
G Protein-Coupled Receptor (GPCR)
Mol. Mass.:
40968.22
Organism:
Homo sapiens (Human)
Description:
The membranes prepared from human platelet were used in binding assay.
Residue:
386
  
Inhibitor
Name:
BDBM85178
Synonyms:
CAS_59122-46-2 MISOPROSTOL (Methyl Ester) | NSC_5282381
Type:
Small organic molecule
Emp. Form.:
C22H38O5
Mol. Mass.:
382.5341
SMILES:
CCCCC(C)(O)CC=CC1C(O)CC(=O)C1CCCCCCC(=O)OC
: