Target
Sodium-dependent dopamine transporter
Ligand
BDBM50005536
Substrate
Ki
14.6±n/a nM
Comments
PDSP_1164
Citation
 Letchworth, SRSmith, HRPorrino, LJBennett, BADavies, HMSexton, TChilders, SR Characterization of a tropane radioligand, [(3)H]2beta-propanoyl-3beta-(4-tolyl) tropane ([(3)H]PTT), for dopamine transport sites in rat brain. J Pharmacol Exp Ther 293:686-96 (2000) Target
Name:
Sodium-dependent dopamine transporter
Synonyms:
DA transporter SC6A3_RAT Sodium-dependent dopamine transporter | Sodium-dependent dopamine transporter (DAT)
Type:
Multi-pass membrane protein
Mol. Mass.:
68749.45
Organism:
Rattus norvegicus (rat)
Description:
P23977
Residue:
619
  
Inhibitor
Name:
BDBM50005536
Synonyms:
42-548 5-(4-chlorophenyl)-3,5-dihydro-2H-imidazo[2,1-a]isoindol-5-ol CHEMBL781 Mazanor mazindole
Type:
Small organic molecule
Emp. Form.:
C16H13ClN2O
Mol. Mass.:
284.74
SMILES:
OC1(N2CCN=C2c2ccccc12)c1ccc(Cl)cc1
: