Target
Sodium-dependent dopamine transporter
Ligand
BDBM50041303
Substrate
Ki
683±n/a nM
Comments
PDSP_1958
Citation
 Letchworth, SRSmith, HRPorrino, LJBennett, BADavies, HMSexton, TChilders, SR Characterization of a tropane radioligand, [(3)H]2beta-propanoyl-3beta-(4-tolyl) tropane ([(3)H]PTT), for dopamine transport sites in rat brain. J Pharmacol Exp Ther 293:686-96 (2000) Target
Name:
Sodium-dependent dopamine transporter
Synonyms:
DA transporter SC6A3_RAT Sodium-dependent dopamine transporter | Sodium-dependent dopamine transporter (DAT)
Type:
Multi-pass membrane protein
Mol. Mass.:
68749.45
Organism:
Rattus norvegicus (rat)
Description:
P23977
Residue:
619
  
Inhibitor
Name:
BDBM50041303
Synonyms:
1-[3-(4-Isopropyl-phenyl)-8-methyl-8-aza-bicyclo[3.2.1]oct-2-yl]-propan-1-one WF-31
Type:
Small organic molecule
Emp. Form.:
C20H29NO
Mol. Mass.:
299.4504
SMILES:
CCC(=O)C1C2CCC(CC1c1ccc(cc1)C(C)C)N2C
: