Target
5-hydroxytryptamine receptor 6
Ligand
BDBM22870
Substrate
Ki
6.31±n/a nM
Comments
PDSP_290
Citation
 Glusa, EPertz, HH Further evidence that 5-HT-induced relaxation of pig pulmonary artery is mediated by endothelial 5-HT(2B) receptors. Br J Pharmacol 130:692-8 (2000)  
Target
Name:
5-hydroxytryptamine receptor 6
Synonyms:
5-HT-6 5-hydroxytryptamine receptor 6 Htr6 Serotonin (5-HT) receptor Serotonin receptor 6
Type:
Enzyme Catalytic Domain
Mol. Mass.:
46945.51
Organism:
RAT
Description:
5-HT6 HTR6 RAT::P31388
Residue:
436
  
Inhibitor
Name:
BDBM22870
Synonyms:
13-chloro-10-(piperazin-1-yl)-2-oxa-9-azatricyclo[9.4.0.0^{3,8}]pentadeca-1(11),3,5,7,9,12,14-heptaene Amoxapine CHEMBL1113 | Demolox
Type:
Small organic molecule
Emp. Form.:
C17H16ClN3O
Mol. Mass.:
313.781
SMILES:
Clc1ccc2Oc3ccccc3N=C(N3CCNCC3)c2c1
: