Target
Leukotriene B4 receptor 2
Ligand
BDBM50292408
Substrate
Ki
3.48±n/a nM
Comments
PDSP_1114
Citation
 Heise, CEO'Dowd, BFFigueroa, DJSawyer, NNguyen, TIm, DSStocco, RBellefeuille, JNAbramovitz, MCheng, RWilliams, DLZeng, ZLiu, QMa, LClements, MKCoulombe, NLiu, YAustin, CPGeorge, SRO'Neill, GPMetters, KMLynch, KREvans, JF Characterization of the human cysteinyl leukotriene 2 receptor. J Biol Chem 275:30531-6 (2000)  
Target
Name:
Leukotriene B4 receptor 2
Synonyms:
BLT2R LT4R2_HUMAN LTB4-R 2 LTB4R2 Leukotriene B4 Leukotriene B4 receptor Leukotriene B4 receptor BLT2 Seven transmembrane receptor BLTR2
Type:
Enzyme Catalytic Domain
Mol. Mass.:
37964.86
Organism:
Homo sapiens (Human)
Description:
Leukotriene 2 0 HUMAN::Q9NPC1
Residue:
358
  
Inhibitor
Name:
BDBM50292408
Synonyms:
(R-(R*,S*-(E,E,Z,Z)))-N-(S-(1-(4-Carboxy-1-hydroxybutyl)-2,4,6,9-pentadecatetraenyl)-L-cysteinyl)glycine CHEMBL288943 S-{(1R,2E,4E,6Z,9Z)-1-[(1S)-4-carboxy-1-hydroxybutyl]pentadeca-2,4,6,9-tetraen-1-yl}-L-cysteinylglycine | leukotriene D4
Type:
Small organic molecule
Emp. Form.:
C25H40N2O6S
Mol. Mass.:
496.66
SMILES:
CCCCC\C=C/C\C=C/C=C/C=C/[C@@H](SC[C@H](N)C(=O)NCC(O)=O)[C@@H](O)CCCC(O)=O
: