Target
Leukotriene B4 receptor 2
Ligand
BDBM85673
Substrate
Ki
>10000±n/a nM
Comments
PDSP_1248
Citation
 Heise, CEO'Dowd, BFFigueroa, DJSawyer, NNguyen, TIm, DSStocco, RBellefeuille, JNAbramovitz, MCheng, RWilliams, DLZeng, ZLiu, QMa, LClements, MKCoulombe, NLiu, YAustin, CPGeorge, SRO'Neill, GPMetters, KMLynch, KREvans, JF Characterization of the human cysteinyl leukotriene 2 receptor. J Biol Chem 275:30531-6 (2000)  
Target
Name:
Leukotriene B4 receptor 2
Synonyms:
BLT2R LT4R2_HUMAN LTB4-R 2 LTB4R2 Leukotriene B4 Leukotriene B4 receptor Leukotriene B4 receptor BLT2 Seven transmembrane receptor BLTR2
Type:
Enzyme Catalytic Domain
Mol. Mass.:
37964.86
Organism:
Homo sapiens (Human)
Description:
Leukotriene 2 0 HUMAN::Q9NPC1
Residue:
358
  
Inhibitor
Name:
BDBM85673
Synonyms:
CAS_5311297 NSC_5311297
Type:
Small organic molecule
Emp. Form.:
C29H28ClNOS
Mol. Mass.:
474.057
SMILES:
CC(C)(O)c1ccccc1CCC(S)c1cccc(C=Cc2ccc3ccc(Cl)cc3n2)c1
: