Target
Sodium-dependent dopamine transporter
Ligand
BDBM50005536
Substrate
Ki
25.9±n/a nM
Comments
PDSP_1164
Citation
 Rothman, RBBaumann, MHDersch, CMRomero, DVRice, KCCarroll, FIPartilla, JS Amphetamine-type central nervous system stimulants release norepinephrine more potently than they release dopamine and serotonin. Synapse 39:32-41 (2001)  
Target
Name:
Sodium-dependent dopamine transporter
Synonyms:
DA transporter SC6A3_RAT Sodium-dependent dopamine transporter | Sodium-dependent dopamine transporter (DAT)
Type:
Multi-pass membrane protein
Mol. Mass.:
68749.45
Organism:
Rattus norvegicus (rat)
Description:
P23977
Residue:
619
  
Inhibitor
Name:
BDBM50005536
Synonyms:
42-548 5-(4-chlorophenyl)-3,5-dihydro-2H-imidazo[2,1-a]isoindol-5-ol CHEMBL781 Mazanor mazindole
Type:
Small organic molecule
Emp. Form.:
C16H13ClN2O
Mol. Mass.:
284.74
SMILES:
OC1(N2CCN=C2c2ccccc12)c1ccc(Cl)cc1
: