Target
Norepinephrine transporter
Ligand
BDBM50246598
Substrate
Ki
244±n/a nM
Comments
PDSP_1478
Citation
 Rothman, RBBaumann, MHDersch, CMRomero, DVRice, KCCarroll, FIPartilla, JS Amphetamine-type central nervous system stimulants release norepinephrine more potently than they release dopamine and serotonin. Synapse 39:32-41 (2001)  
Target
Name:
Norepinephrine transporter
Synonyms:
Type:
Enzyme Catalytic Domain
Mol. Mass.:
2082.45
Organism:
RAT
Description:
Norepinephrine transporter 0 RAT::Q9JIA2
Residue:
19
MLLARMKPQVQPELGGADQ
  
Inhibitor
Name:
BDBM50246598
Synonyms:
2-methyl-1-phenylpropan-2-amine PHENTERMINE | alpha,alpha-Dimethylphenethylamine
Type:
Small organic molecule
Emp. Form.:
C10H15N
Mol. Mass.:
149.2328
SMILES:
CC(C)(N)Cc1ccccc1
: