Target
Norepinephrine transporter
Ligand
BDBM29135
Substrate
Ki
72.5±n/a nM
Comments
PDSP_2003
Citation
 Rothman, RBBaumann, MHDersch, CMRomero, DVRice, KCCarroll, FIPartilla, JS Amphetamine-type central nervous system stimulants release norepinephrine more potently than they release dopamine and serotonin. Synapse 39:32-41 (2001)  
Target
Name:
Norepinephrine transporter
Synonyms:
Type:
Enzyme Catalytic Domain
Mol. Mass.:
2082.45
Organism:
RAT
Description:
Norepinephrine transporter 0 RAT::Q9JIA2
Residue:
19
MLLARMKPQVQPELGGADQ
  
Inhibitor
Name:
BDBM29135
Synonyms:
CHEMBL11608 p-Tyramine | tyramine
Type:
Small organic molecule
Emp. Form.:
C8H11NO
Mol. Mass.:
137.179
SMILES:
NCCc1ccc(O)cc1
: