Target
Cysteinyl leukotriene receptor 1
Ligand
BDBM85673
Substrate
Ki
2.3±n/a nM
Comments
PDSP_1248
Citation
 Nothacker, HPWang, ZZhu, YReinscheid, RKLin, SHCivelli, O Molecular cloning and characterization of a second human cysteinyl leukotriene receptor: discovery of a subtype selective agonist. Mol Pharmacol 58:1601-8 (2000)  
Target
Name:
Cysteinyl leukotriene receptor 1
Synonyms:
CLTR1_HUMAN CYSLTR1 Cysteinyl leukotriene receptor HG55 LTD4 receptor | Leukotriene Cysteinyl 1
Type:
Enzyme Catalytic Domain
Mol. Mass.:
38565.16
Organism:
Homo sapiens (Human)
Description:
Leukotriene Cysteinyl 1 CYSLTR1 HUMAN::Q9Y271
Residue:
337
  
Inhibitor
Name:
BDBM85673
Synonyms:
CAS_5311297 NSC_5311297
Type:
Small organic molecule
Emp. Form.:
C29H28ClNOS
Mol. Mass.:
474.057
SMILES:
CC(C)(O)c1ccccc1CCC(S)c1cccc(C=Cc2ccc3ccc(Cl)cc3n2)c1
: