Target
Tyrosinase
Ligand
BDBM50218211
Substrate
Meas. Tech.
Inhibition Assay
pH
6.8±0
Temperature
310.15±0 K
IC50
1.72e+3± 43.76 nM
Citation
 Khan, KMSaify, ZSKhan, MTButt, NMaharvi, GMPerveen, SAmbreen, NChoudhary, MIAtta-Ur-Rahman, ASupuran, CT Tyrosinase inhibition: conformational analysis based studies on molecular dynamics calculations of bipiperidine based inhibitors. J Enzyme Inhib Med Chem 20:401-7 (2005)  
Target
Name:
Tyrosinase
Synonyms:
LB24-AB SK29-AB TYRO_HUMAN | Tumor rejection antigen AB
Type:
Protein
Mol. Mass.:
60388.08
Organism:
Homo sapiens (Human)
Description:
P14679
Residue:
529
  
Inhibitor
Name:
BDBM50218211
Synonyms:
1'-(4-Methyl-benzyl)-[1,4']bipiperidinyl Tyrosinase Inhibitor, 4
Type:
Small organic molecule
Emp. Form.:
C18H28N2
Mol. Mass.:
272.4283
SMILES:
Cc1ccc(CN2CCC(CC2)N2CCCCC2)cc1
: