Target
Adenosine receptor A3
Ligand
BDBM85777
Substrate
Ki
6.79±n/a nM
Comments
PDSP_2054
Citation
 Durand, IHGreen, RD Cloning of a chick A3 adenosine receptor: characterization of ligand binding and receptor-effector coupling of chick A1 and A3 adenosine receptors. Naunyn Schmiedebergs Arch Pharmacol 363:81-6 (2001)  
Target
Name:
Adenosine receptor A3
Synonyms:
ADENOSINE A3 | ADORA3
Type:
Enzyme Catalytic Domain
Mol. Mass.:
37723.59
Organism:
Chick
Description:
A0A8V1ACC1
Residue:
338
  
Inhibitor
Name:
BDBM85777
Synonyms:
B-NECA
Type:
Small organic molecule
Emp. Form.:
C17H18N6O4
Mol. Mass.:
370.3626
SMILES:
Nc1ncnc2n(cnc12)[C@@H]1O[C@@H]([C@@H](O)[C@H]1O)C(=O)NCc1ccccc1
: