Target
5-hydroxytryptamine receptor 4
Ligand
BDBM29525
Substrate
Ki
0.05±n/a nM
Comments
PDSP_2065
Citation
 Bach, TSyversveen, TKvingedal, AMKrobert, KABrattelid, TKaumann, AJLevy, FO 5HT4(a) and 5-HT4(b) receptors have nearly identical pharmacology and are both expressed in human atrium and ventricle. Naunyn Schmiedebergs Arch Pharmacol 363:146-60 (2001)  
Target
Name:
5-hydroxytryptamine receptor 4
Synonyms:
5-HT-4 5-HT4S 5-HT4b 5-HT4d 5-hydroxytryptamine receptor 4 5HT4R_HUMAN Serotonin (5-HT) receptor Serotonin 4 (5-HT4) receptor | Serotonin Receptor 4
Type:
Enzyme
Mol. Mass.:
43767.54
Organism:
Homo sapiens (Human)
Description:
Q13639
Residue:
388
  
Inhibitor
Name:
BDBM29525
Synonyms:
3H-GR113808 GR 113808 [3H]GR113808
Type:
radiolabeled ligand
Emp. Form.:
C19H27N3O4S
Mol. Mass.:
393.5
SMILES:
Cn1cc(C(=O)OCC2CCN(CCNS(C)(=O)=O)CC2)c2ccccc12
: