Target
Diacylglycerol O-acyltransferase 2
Ligand
BDBM276761
Substrate
Meas. Tech.
In Vitro DGAT2 Assay
pH
7.4±n/a
Temperature
298.15±n/a K
IC50
23.2±n/a nM
Comments
extracted
Citation
 Boehm, MCabral, SDowling, MSFutatsugi, KHuard, KLee, ECLondregan, ATPolivkova, JPrice, DALi, Q Diacylglycerol acyl transferase 2 inhibitors US Patent  US10071992 Publication Date 9/11/2018 
Target
Name:
Diacylglycerol O-acyltransferase 2
Synonyms:
ARAT DGAT2 Diacylglycerol O-acyltransferase 2 (DGAT2) Retinol O-fatty-acyltransferase
Type:
Multi-pass membrane protein
Mol. Mass.:
43848.90
Organism:
Homo sapiens (Human)
Description:
Q96PD7
Residue:
388
  
Inhibitor
Name:
BDBM276761
Synonyms:
(S)-2-(5-((3-ethoxypyridin-2-yl)oxy)pyridin-3-yl)-N-(3-(hydroxymethyl)tetrahydrofuran-3-yl)pyrimidine-5-carboxamide US11034678, Example 6b WO2018033832, Ex. 6a
Type:
Small organic molecule
Emp. Form.:
C22H23N5O5
Mol. Mass.:
437.4485
SMILES:
CCOc1cccnc1Oc1cncc(c1)-c1ncc(cn1)C(=O)N[C@]1(CO)CCOC1
: