Target
Bone morphogenetic protein receptor type-1A
Ligand
BDBM118134
Substrate
Meas. Tech.
Enzyme Assay
IC50
278±n/a nM
Citation
 Alimardanov, ACuny, GDGrewal, GSLee, AMcKew, JCMohedas, AHShen, MXu, XYu, PB BMP inhibitors and methods of use thereof US Patent  US10017516 Publication Date 7/10/2018 
Target
Name:
Bone morphogenetic protein receptor type-1A
Synonyms:
ACVRLK3 Activin receptor-like kinase 3 (ALK-3) BMR1A_HUMAN
Type:
Enzyme
Mol. Mass.:
60204.46
Organism:
Homo sapiens (Human)
Description:
P36894
Residue:
532
  
Inhibitor
Name:
BDBM118134
Synonyms:
US10017516, Compound 3 | US9682983, 3
Type:
Small organic molecule
Emp. Form.:
C24H21N7
Mol. Mass.:
407.4704
SMILES:
C1CN(CCN1)c1ccc(nc1)-c1cnc2c(cnn2c1)-c1ccnc2ccccc12
: