Target
Bone morphogenetic protein receptor type-1A
Ligand
BDBM143246
Substrate
Meas. Tech.
Enzyme Assay
IC50
212±n/a nM
Citation
 Alimardanov, ACuny, GDGrewal, GSLee, AMcKew, JCMohedas, AHShen, MXu, XYu, PB BMP inhibitors and methods of use thereof US Patent  US10017516 Publication Date 7/10/2018 
Target
Name:
Bone morphogenetic protein receptor type-1A
Synonyms:
ACVRLK3 Activin receptor-like kinase 3 (ALK-3) BMR1A_HUMAN
Type:
Enzyme
Mol. Mass.:
60204.46
Organism:
Homo sapiens (Human)
Description:
P36894
Residue:
532
  
Inhibitor
Name:
BDBM143246
Synonyms:
US10017516, Compound 8 | US9682983, 8
Type:
Small organic molecule
Emp. Form.:
C25H21ClN6
Mol. Mass.:
440.927
SMILES:
Clc1cc(-c2cnn3cc(cnc23)-c2ccc(cc2)N2CCNCC2)c2ccccc2n1
: