Target
Activin receptor type-1
Ligand
BDBM161920
Substrate
Meas. Tech.
Enzyme Assay
IC50
8.00±n/a nM
Citation
 Alimardanov, ACuny, GDGrewal, GSLee, AMcKew, JCMohedas, AHShen, MXu, XYu, PB BMP inhibitors and methods of use thereof US Patent  US10017516 Publication Date 7/10/2018 
Target
Name:
Activin receptor type-1
Synonyms:
2.7.11.30 ACVR1 ACVRLK2 ALK2/ACVR1 Activin receptor-like kinase 2 Activin receptor-like kinase 2 (ALK2/ACVR1) SKR1 TGF-B superfamily receptor type I | TSR-I
Type:
Mol. Mass.:
57158.32
Organism:
Homo sapiens (Human)
Description:
Residue:
509
  
Inhibitor
Name:
BDBM161920
Synonyms:
US10017516, Compound 53 US9682983, 53
Type:
Small organic molecule
Emp. Form.:
C27H26N6
Mol. Mass.:
434.5355
SMILES:
C[C@H]1CNC[C@@H](C)N1c1ccc(cc1)-c1cnc2c(cnn2c1)-c1cccc2ncccc12
: