Target
D(2) dopamine receptor
Ligand
BDBM50010684
Substrate
Ki
2108±n/a nM
Comments
PDSP_4569
Citation
 Kilts, JDConnery, HSArrington, EGLewis, MMLawler, CPOxford, GSO'Malley, KLTodd, RDBlake, BLNichols, DEMailman, RB Functional selectivity of dopamine receptor agonists. II. Actions of dihydrexidine in D2L receptor-transfected MN9D cells and pituitary lactotrophs. J Pharmacol Exp Ther 301:1179-89 (2002)  
Target
Name:
D(2) dopamine receptor
Synonyms:
D(2) dopamine receptor DOPAMINE D2 Long DRD2 Dopamine D2 receptor Dopamine D2 receptor (D2R) Dopamine2-like | d2
Type:
Cell-surface receptors
Mol. Mass.:
50647.10
Organism:
Homo sapiens (Human)
Description:
P14416
Residue:
443
  
Inhibitor
Name:
BDBM50010684
Synonyms:
(6aR,12bS)-6-Propyl-5,6,6a,7,8,12b-hexahydro-benzo[a]phenanthridine-10,11-diol CHEMBL299161 | N-n-propyldihydrexidine, N-Pr-DHX
Type:
Small organic molecule
Emp. Form.:
C20H23NO2
Mol. Mass.:
309.4021
SMILES:
CCCN1Cc2ccccc2[C@H]2[C@H]1CCc1cc(O)c(O)cc21
: