Target
Aromatase
Ligand
BDBM9460
Substrate
Meas. Tech.
Aromatase Assay
Temperature
310.15±0 K
IC50
1.85e+4±n/a nM
Citation
 Saberi, MRShah, KSimons, C Benzofuran- and furan-2-yl-(phenyl)-3-pyridylmethanols: synthesis and inhibition of P450 aromatase. J Enzyme Inhib Med Chem 20:135-41 (2005)  
Target
Name:
Aromatase
Synonyms:
ARO1 CP19A_HUMAN CYP19 CYPXIX Cytochrome P450 19A1 Cytochrome P450-C19 (CYP19) FL cytokine receptor precursor | P-450AROM
Type:
Enzyme
Mol. Mass.:
57888.92
Organism:
Homo sapiens (Human)
Description:
P11511
Residue:
503
  
Inhibitor
Name:
BDBM9460
Synonyms:
3-(4-aminophenyl)-3-ethyl-piperidine-2,6-dione Aminoglutethimide AG, 4 Cytadren Elipten | aminoglutethimide (AG)
Type:
Small organic molecule
Emp. Form.:
C13H16N2O2
Mol. Mass.:
232.2783
SMILES:
CCC1(CCC(=O)NC1=O)c1ccc(N)cc1
: