Target
Histamine H1 receptor
Ligand
BDBM35938
Substrate
Ki
4.81±n/a nM
Comments
PDSP_628
Citation
 Booth, RGMoniri, NHBakker, RAChoksi, NYNix, WBTimmerman, HLeurs, R A novel phenylaminotetralin radioligand reveals a subpopulation of histamine H(1) receptors. J Pharmacol Exp Ther 302:328-36 (2002)  
Target
Name:
Histamine H1 receptor
Synonyms:
H1R HISTAMINE H1 HRH1_HUMAN
Type:
G Protein-Coupled Receptor (GPCR)
Mol. Mass.:
55808.72
Organism:
Homo sapiens (Human)
Description:
Cell pellets from SK-N-MC cells transfected with human H1 receptor were used in binding assay.
Residue:
487
  
Inhibitor
Name:
BDBM35938
Synonyms:
1-(p-chlorophenyl)-1-(2-pyridyl)-3-N,N-dimethylpropylamine 3-(p-chlorophenyl)-3-(2-pyridyl)-N,N-dimethylpropylamine CHEMBL505 CHLORPHENIRAMINE MALEATE Polaramine [3H]Chlorphenamine chlorophenylpyridamine clorfeniramina gamma-(4-chlorophenyl)-N,N-dimethyl-2-pyridinepropanamine | gamma-(4-chlorophenyl)-gamma-(2-pyridyl)propyldimethylamine
Type:
radiolabeled ligand
Emp. Form.:
C16H19ClN2
Mol. Mass.:
274.788
SMILES:
CN(C)CCC(c1ccc(Cl)cc1)c1ccccn1
: