Target
D(4) dopamine receptor
Ligand
BDBM86052
Substrate
Ki
56.23±n/a nM
Comments
PDSP_3290
Citation
 Millan, MJMaiofiss, LCussac, DAudinot, VBoutin, JANewman-Tancredi, A Differential actions of antiparkinson agents at multiple classes of monoaminergic receptor. I. A multivariate analysis of the binding profiles of 14 drugs at 21 native and cloned human receptor subtypes. J Pharmacol Exp Ther 303:791-804 (2002)  
Target
Name:
D(4) dopamine receptor
Synonyms:
D(2C) dopamine receptor DOPAMINE D4.2 DRD4 Dopamine D4 receptor
Type:
Enzyme
Mol. Mass.:
48373.19
Organism:
Homo sapiens (Human)
Description:
P21917
Residue:
419
  
Inhibitor
Name:
BDBM86052
Synonyms:
CAS_54746 NSC_54746
Type:
Small organic molecule
Emp. Form.:
C26H37N5O2
Mol. Mass.:
451.6043
SMILES:
CCNC(=O)N(CCCN(C)C)C(=O)C1CC2C(Cc3c[nH]c4cccc2c34)N(CC=C)C1
: