Target
Ninein
Ligand
BDBM7262
Substrate
Ki
110±n/a nM
Comments
PDSP_6408
Citation
 Bain, JMcLauchlan, HElliott, MCohen, P The specificities of protein kinase inhibitors: an update. Biochem J 371:199-204 (2003)  
Target
Name:
Ninein
Synonyms:
Glycogen synthase kinase 3 NIN Ninein
Type:
Enzyme Catalytic Domain
Mol. Mass.:
243138.33
Organism:
Homo sapiens (Human)
Description:
Glycogen synthase kinase 3 0 HUMAN::Q8N4C6
Residue:
2090
  
Inhibitor
Name:
BDBM7262
Synonyms:
14-nitro-8,18-diazatetracyclo[9.7.0.0^{2,7}.0^{12,17}]octadeca-1(11),2,4,6,12(17),13,15-heptaen-9-one BDBM84528 NSC 705701 alsterpaullone
Type:
Small organic molecule
Emp. Form.:
C16H11N3O3
Mol. Mass.:
293.2768
SMILES:
[O-][N+](=O)c1ccc2[nH]c-3c(CC(=O)Nc4ccccc-34)c2c1
: