Target
Type-1 angiotensin II receptor A
Ligand
BDBM50240609
Substrate
Ki
0.12±n/a nM
Comments
PDSP_3386
Citation
 Inada, YNakane, TChiba, S Binding of KRH-594, an antagonist of the angiotensin II type 1 receptor, to cloned human and rat angiotensin II receptors. Fundam Clin Pharmacol 16:317-23 (2002)  
Target
Name:
Type-1 angiotensin II receptor A
Synonyms:
AGTRA_RAT Agtr1 Angiotensin II AT1 Angiotensin II receptor (AT-1) type-1 Type-1A angiotensin II receptor
Type:
Enzyme Catalytic Domain
Mol. Mass.:
40910.53
Organism:
RAT
Description:
ANGIOTENSIN AT1 AGTR1 RAT::P25095
Residue:
359
  
Inhibitor
Name:
BDBM50240609
Synonyms:
2-Ethoxy-3-[2'-(1H-tetrazol-5-yl)-biphenyl-4-ylmethyl]-3H-benzoimidazole-4-carboxylic acid(CV-11974) 2-ethoxy-3-[2'-(1H-tetrazol-5-yl)-biphenyl-4-ylmethyl]-3H-benzoimidazole-4-carboxylic acid CHEMBL1016 | CV-11974
Type:
Small organic molecule
Emp. Form.:
C24H20N6O3
Mol. Mass.:
440.454
SMILES:
CCOc1nc2cccc(C(O)=O)c2n1Cc1ccc(cc1)-c1ccccc1-c1nnn[nH]1
: