Target
D(1A) dopamine receptor
Ligand
BDBM86176
Substrate
Ki
18±n/a nM
Comments
PDSP_5007
Citation
 Qandil, AMLewis, MMJassen, ALeonard, SKMailman, RBNichols, DE Synthesis and pharmacological evaluation of substituted naphth[1,2,3-de]isoquinolines (dinapsoline analogues) as D1 and D2 dopamine receptor ligands. Bioorg Med Chem 11:1451-64 (2003)  
Target
Name:
D(1A) dopamine receptor
Synonyms:
DOPAMINE D1 Dopamine D1 high Dopamine receptor Dopamine1-like Drd1a
Type:
Enzyme Catalytic Domain
Mol. Mass.:
49429.75
Organism:
RAT
Description:
P18901
Residue:
446
  
Inhibitor
Name:
BDBM86176
Synonyms:
Dihydrexidine, 4-methyl
Type:
Small organic molecule
Emp. Form.:
C18H19NO2
Mol. Mass.:
281.349
SMILES:
Cc1cccc2[C@@H]3[C@H](CCc4cc(O)c(O)cc34)NCc12
: