Target
Calcium-activated potassium channel subunit beta
Ligand
BDBM86245
Substrate
Ki
251±n/a nM
Comments
PDSP_3712
Citation
 Davis-Taber, RMolinari, EJAltenbach, RJWhiteaker, KLShieh, CCRotert, GBuckner, SAMalysz, JMilicic, IMcDermott, JSGintant, GACoghlan, MJCarroll, WAScott, VEGopalakrishnan, M [125I]A-312110, a novel high-affinity 1,4-dihydropyridine ATP-sensitive K+ channel opener: characterization and pharmacology of binding. Mol Pharmacol 64:143-53 (2003)  
Target
Name:
Calcium-activated potassium channel subunit beta
Synonyms:
Potassium channel (ATP modulatory)
Type:
Enzyme Catalytic Domain
Mol. Mass.:
22836.62
Organism:
GUINEA PIG
Description:
C0KY85
Residue:
199
  
Inhibitor
Name:
BDBM86245
Synonyms:
CAS_85371-64-8 PINACIDIL
Type:
Small organic molecule
Emp. Form.:
C13H19N5
Mol. Mass.:
245.3235
SMILES:
CC(N=C(NC#N)Nc1ccncc1)C(C)(C)C
: