Target
Calcium-activated potassium channel subunit beta
Ligand
BDBM86249
Substrate
Ki
451±n/a nM
Comments
PDSP_3714
Citation
 Davis-Taber, RMolinari, EJAltenbach, RJWhiteaker, KLShieh, CCRotert, GBuckner, SAMalysz, JMilicic, IMcDermott, JSGintant, GACoghlan, MJCarroll, WAScott, VEGopalakrishnan, M [125I]A-312110, a novel high-affinity 1,4-dihydropyridine ATP-sensitive K+ channel opener: characterization and pharmacology of binding. Mol Pharmacol 64:143-53 (2003)  
Target
Name:
Calcium-activated potassium channel subunit beta
Synonyms:
Potassium channel (ATP modulatory)
Type:
Enzyme Catalytic Domain
Mol. Mass.:
22836.62
Organism:
GUINEA PIG
Description:
C0KY85
Residue:
199
  
Inhibitor
Name:
BDBM86249
Synonyms:
ZD 6169 | ZD-6169
Type:
Small organic molecule
Emp. Form.:
C17H14F3NO3
Mol. Mass.:
337.2932
SMILES:
C[C@](O)(C(=O)Nc1ccc(cc1)C(=O)c1ccccc1)C(F)(F)F
: