Target
Sodium-dependent noradrenaline transporter
Ligand
BDBM86420
Substrate
Ki
200±n/a nM
Comments
PDSP_5695
Citation
 Koch, SHemrick-Luecke, SKThompson, LKEvans, DCThrelkeld, PGNelson, DLPerry, KWBymaster, FP Comparison of effects of dual transporter inhibitors on monoamine transporters and extracellular levels in rats. Neuropharmacology 45:935-44 (2003)  
Target
Name:
Sodium-dependent noradrenaline transporter
Synonyms:
Monoamine transporter NET Noradrenaline Transporter (NET) Norepinephrine transporter protein (NET) SLC6A2 Sodium-dependent noradrenaline transporter (NET) | Solute carrier family 6 member 2
Type:
Multi-pass membrane protein
Mol. Mass.:
69337.72
Organism:
Homo sapiens (Human)
Description:
P23975
Residue:
617
  
Inhibitor
Name:
BDBM86420
Synonyms:
CAS_92623-85-3 NSC_0
Type:
Small organic molecule
Emp. Form.:
C15H22N2O
Mol. Mass.:
246.348
SMILES:
CCN(CC)C(=O)[C@@]1(C[C@@H]1CN)c1ccccc1
: