Target
Neuronal acetylcholine receptor subunit alpha-4
Ligand
BDBM50061568
Substrate
Ki
2900±n/a nM
Comments
PDSP_3247
Citation
 Eaton, JBPeng, JHSchroeder, KMGeorge, AAFryer, JDKrishnan, CBuhlman, LKuo, YPSteinlein, OLukas, RJ Characterization of human alpha 4 beta 2-nicotinic acetylcholine receptors stably and heterologously expressed in native nicotinic receptor-null SH-EP1 human epithelial cells. Mol Pharmacol 64:1283-94 (2003)  
Target
Name:
Neuronal acetylcholine receptor subunit alpha-4
Synonyms:
ACHA4_HUMAN CHRNA4 protein Neuronal acetylcholine receptor protein alpha-4 subunit Nicotinic acetylcholine receptor alpha4/beta2/alpha5
Type:
Mol. Mass.:
69963.49
Organism:
Homo sapiens (Human)
Description:
NACHRA4
Residue:
627
  
Inhibitor
Name:
BDBM50061568
Synonyms:
2,2'-[(1,4-dioxobutane-1,4-diyl)bis(oxy)]bis(N,N,N-trimethylethanaminium) Dicholine succinate Succinocholine Succinylbischoline suxamethonium
Type:
Small organic molecule
Emp. Form.:
C14H30N2O4
Mol. Mass.:
290.3979
SMILES:
C[N+](C)(C)CCOC(=O)CCC(=O)OCC[N+](C)(C)C
: