Target
D(1A) dopamine receptor
Ligand
BDBM86464
Substrate
Ki
3000±n/a nM
Comments
PDSP_4957
Citation
 Sit, SYXie, KJacutin-Porte, SBoy, KMSeanz, JTaber, MTGulwadi, AGKorpinen, CDBurris, KDMolski, TFRyan, EXu, CVerdoorn, TJohnson, GNichols, DEMailman, RB Synthesis and SAR exploration of dinapsoline analogues. Bioorg Med Chem 12:715-34 (2004)  
Target
Name:
D(1A) dopamine receptor
Synonyms:
DOPAMINE D1 Dopamine D1 high Dopamine receptor Dopamine1-like Drd1a
Type:
Enzyme Catalytic Domain
Mol. Mass.:
49429.75
Organism:
RAT
Description:
P18901
Residue:
446
  
Inhibitor
Name:
BDBM86464
Synonyms:
(-)-6-fluorodinapsoline hydrobromide NSC_0
Type:
Small organic molecule
Emp. Form.:
C16H14FNO2
Mol. Mass.:
271.2863
SMILES:
Oc1ccc2C3CNCc4ccc(F)c(Cc2c1O)c34
: