Target
D(1A) dopamine receptor
Ligand
BDBM86459
Substrate
Ki
69±n/a nM
Comments
PDSP_4961
Citation
 Sit, SYXie, KJacutin-Porte, SBoy, KMSeanz, JTaber, MTGulwadi, AGKorpinen, CDBurris, KDMolski, TFRyan, EXu, CVerdoorn, TJohnson, GNichols, DEMailman, RB Synthesis and SAR exploration of dinapsoline analogues. Bioorg Med Chem 12:715-34 (2004)  
Target
Name:
D(1A) dopamine receptor
Synonyms:
DOPAMINE D1 Dopamine D1 high Dopamine receptor Dopamine1-like Drd1a
Type:
Enzyme Catalytic Domain
Mol. Mass.:
49429.75
Organism:
RAT
Description:
P18901
Residue:
446
  
Inhibitor
Name:
BDBM86459
Synonyms:
4-fluorodinapsoline hydrobromide NSC_0
Type:
Small organic molecule
Emp. Form.:
C16H14FNO2
Mol. Mass.:
271.2863
SMILES:
Oc1ccc2[C@@H]3CNCc4c(F)ccc(Cc2c1O)c34
: