Target
D(2) dopamine receptor
Ligand
BDBM86467
Substrate
Ki
>10000±n/a nM
Comments
PDSP_4955
Citation
 Sit, SYXie, KJacutin-Porte, SBoy, KMSeanz, JTaber, MTGulwadi, AGKorpinen, CDBurris, KDMolski, TFRyan, EXu, CVerdoorn, TJohnson, GNichols, DEMailman, RB Synthesis and SAR exploration of dinapsoline analogues. Bioorg Med Chem 12:715-34 (2004)  
Target
Name:
D(2) dopamine receptor
Synonyms:
D(2) dopamine receptor DOPAMINE D2 Long DRD2 Dopamine D2 receptor Dopamine D2 receptor (D2R) Dopamine2-like | d2
Type:
Cell-surface receptors
Mol. Mass.:
50647.10
Organism:
Homo sapiens (Human)
Description:
P14416
Residue:
443
  
Inhibitor
Name:
BDBM86467
Synonyms:
(+/-)-2,3-Dimethyldinapsoline hydrobromide NSC_0
Type:
Small organic molecule
Emp. Form.:
C18H19NO2
Mol. Mass.:
281.349
SMILES:
CC1N(C)C[C@H]2c3ccc(O)c(O)c3Cc3cccc1c23
: