Target
Neuronal acetylcholine receptor subunit alpha-2
Ligand
BDBM50061565
Substrate
Ki
>10000±n/a nM
Comments
PDSP_1187
Citation
 Xiao, YKellar, KJ The comparative pharmacology and up-regulation of rat neuronal nicotinic receptor subtype binding sites stably expressed in transfected mammalian cells. J Pharmacol Exp Ther 310:98-107 (2004)  
Target
Name:
Neuronal acetylcholine receptor subunit alpha-2
Synonyms:
ACHA2_RAT Cholinergic, Nicotinic Alpha2Beta2 Chrna2
Type:
Enzyme
Mol. Mass.:
58597.25
Organism:
Rattus norvegicus (Rat)
Description:
P12389
Residue:
511
  
Inhibitor
Name:
BDBM50061565
Synonyms:
(+)Methyl-(2,3,3-trimethyl-bicyclo[2.2.1]hept-2-yl)-amine (-)Methyl-(2,3,3-trimethyl-bicyclo[2.2.1]hept-2-yl)-amine MECAMYLAMINE Methyl-(2,3,3-trimethyl-bicyclo[2.2.1]hept-2-yl)-amine(Mecamylamine)
Type:
Small organic molecule
Emp. Form.:
C11H21N
Mol. Mass.:
167.2911
SMILES:
CNC1(C)C2CCC(C2)C1(C)C
: