Target
Neuronal acetylcholine receptor subunit alpha-3
Ligand
BDBM50171347
Substrate
Ki
78±n/a nM
Comments
PDSP_218
Citation
 Xiao, YKellar, KJ The comparative pharmacology and up-regulation of rat neuronal nicotinic receptor subtype binding sites stably expressed in transfected mammalian cells. J Pharmacol Exp Ther 310:98-107 (2004)  
Target
Name:
Neuronal acetylcholine receptor subunit alpha-3
Synonyms:
ACHA3_RAT Chrna3
Type:
Enzyme
Mol. Mass.:
56995.52
Organism:
Rattus norvegicus (Rat)
Description:
P04757
Residue:
499
  
Inhibitor
Name:
BDBM50171347
Synonyms:
3-(Azetidin-2-ylmethoxy)-pyridine CHEMBL190589
Type:
Small organic molecule
Emp. Form.:
C9H12N2O
Mol. Mass.:
164.2044
SMILES:
C(Oc1cccnc1)C1CCN1
: