Target
P2X purinoceptor 2
Ligand
BDBM86478
Substrate
Ki
0.9±n/a nM
Comments
PDSP_4073
Citation
 Jarvis, MFBianchi, BUchic, JTCartmell, JLee, CHWilliams, MFaltynek, C [3H]A-317491, a novel high-affinity non-nucleotide antagonist that specifically labels human P2X2/3 and P2X3 receptors. J Pharmacol Exp Ther 310:407-16 (2004)  
Target
Name:
P2X purinoceptor 2
Synonyms:
ATP receptor P2RX2_HUMAN Purinergic receptor | PurinergicP2X2/3
Type:
Enzyme Catalytic Domain
Mol. Mass.:
51765.18
Organism:
Homo sapiens (Human)
Description:
PurinergicP2X2/3 0 HUMAN::Q9UBL9
Residue:
471
  
Inhibitor
Name:
BDBM86478
Synonyms:
A-317491
Type:
Small organic molecule
Emp. Form.:
C33H27NO8
Mol. Mass.:
565.5694
SMILES:
OC(=O)c1cc(C(O)=O)c(cc1C(O)=O)C(=O)N(Cc1cccc(Oc2ccccc2)c1)[C@H]1CCCc2ccccc12
: