Target
P2X purinoceptor 2
Ligand
BDBM50164644
Substrate
Ki
75.6±n/a nM
Comments
PDSP_4065
Citation
 Jarvis, MFBianchi, BUchic, JTCartmell, JLee, CHWilliams, MFaltynek, C [3H]A-317491, a novel high-affinity non-nucleotide antagonist that specifically labels human P2X2/3 and P2X3 receptors. J Pharmacol Exp Ther 310:407-16 (2004)  
Target
Name:
P2X purinoceptor 2
Synonyms:
ATP receptor P2RX2_HUMAN Purinergic receptor | PurinergicP2X2/3
Type:
Enzyme Catalytic Domain
Mol. Mass.:
51765.18
Organism:
Homo sapiens (Human)
Description:
PurinergicP2X2/3 0 HUMAN::Q9UBL9
Residue:
471
  
Inhibitor
Name:
BDBM50164644
Synonyms:
2',3'-Dideoxyadenosine Triphosphate (Ddatp) ATP,2',3'-dideoxy [[[5-(6-amino-9H-purin-9-yl)tetrahydrofuran-2-yl]methoxy-hydroxy-phosphoryl]oxy-hydroxy-phosphoryl]oxyphosphonic acid ddATP
Type:
Small organic molecule
Emp. Form.:
C10H16N5O11P3
Mol. Mass.:
475.1822
SMILES:
Nc1ncnc2n(cnc12)[C@H]1CC[C@@H](COP(O)(=O)OP(O)(=O)OP(O)(O)=O)O1
: