Target
Mu-type opioid receptor
Ligand
BDBM86258
Substrate
Ki
2.06±n/a nM
Comments
PDSP_1250
Citation
 Valenzano, KJMiller, WChen, ZShan, SCrumley, GVictory, SFDavies, EHuang, JCAllie, NNolan, SJRotshteyn, YKyle, DJBroglé, K DiPOA ([8-(3,3-diphenyl-propyl)-4-oxo-1-phenyl-1,3,8-triazaspiro[4.5]dec-3-yl]-acetic acid), a novel, systemically available, and peripherally restricted mu opioid agonist with antihyperalgesic activity: I. In vitro pharmacological characterization and pharmacokinetic properties. J Pharmacol Exp Ther 310:783-92 (2004)  
Target
Name:
Mu-type opioid receptor
Synonyms:
M-OR-1 MOR-1 MUOR1 Mu opiate receptor OPRM1 hMOP | mu-type opioid receptor isoform MOR-1
Type:
G Protein-Coupled Receptor (GPCR)
Mol. Mass.:
44789.51
Organism:
Homo sapiens (Human)
Description:
P35372
Residue:
400
  
Inhibitor
Name:
BDBM86258
Synonyms:
CAS_23552-18-3 NSC_5980
Type:
Small organic molecule
Emp. Form.:
C17H19NO3
Mol. Mass.:
285.3377
SMILES:
CN1CCC23C4Oc5c2c(CC1C3C=CC4O)ccc5O
: