Target
Kappa-type opioid receptor
Ligand
BDBM86548
Substrate
Ki
7.9±n/a nM
Comments
PDSP_2950
Citation
 Wang, YTang, KInan, SSiebert, DHolzgrabe, ULee, DYHuang, PLi, JGCowan, ALiu-Chen, LY Comparison of pharmacological activities of three distinct kappa ligands (Salvinorin A, TRK-820 and 3FLB) on kappa opioid receptors in vitro and their antipruritic and antinociceptive activities in vivo. J Pharmacol Exp Ther 312:220-30 (2005)  
Target
Name:
Kappa-type opioid receptor
Synonyms:
K-OR-1 Kappa-opioid receptor (KOR) Kappa-type opioid receptor (KOR) OPIATE Kappa OPRK1 kappa opioid receptor (KOR)
Type:
G Protein-Coupled Receptor (GPCR)
Mol. Mass.:
42648.76
Organism:
Homo sapiens (Human)
Description:
P41145
Residue:
380
  
Inhibitor
Name:
BDBM86548
Synonyms:
CAS_83729-01-5 Salvinorin A
Type:
Small organic molecule
Emp. Form.:
C23H28O8
Mol. Mass.:
432.4636
SMILES:
COC(=O)C1CC(OC(C)=O)C(=O)C2C1(C)CCC1C(=O)OC(CC21C)c1ccoc1
: